Target
Adenylate kinase 2, mitochondrial
Ligand
BDBM50367100
Substrate
Meas. Tech.
ChEMBL_32050 (CHEMBL644150)
Ki
5400000±n/a nM
Citation
 Hai, TTPicker, DAbo, MHampton, A Species- or isozyme-specific enzyme inhibitors. 7. Selective effects in inhibitions of rat adenylate kinase isozymes by adenosine 5'-phosphate derivatives. J Med Chem 25:806-12 (1982)  
Target
Name:
Adenylate kinase 2, mitochondrial
Synonyms:
2.7.4.3 ATP-AMP transphosphorylase 2 Adenylate kinase 2 Adenylate monophosphate kinase KAD2_RAT
Type:
Mol. Mass.:
26380.21
Organism:
Rattus norvegicus
Description:
Residue:
239
  
Inhibitor
Name:
BDBM50367100
Synonyms:
CHEMBL607942
Type:
Small organic molecule
Emp. Form.:
C12H18N5O7P
Mol. Mass.:
375.2744
SMILES:
CC[C@@H](OP(O)(O)=O)[C@H]1OC([C@H](O)[C@@H]1O)n1cnc2c(N)ncnc12
: