Target
Angiotensin-converting enzyme
Ligand
BDBM21642
Substrate
Meas. Tech.
ChEBML_36882
IC50
1300±n/a nM
Citation
 Roark, WHTinney, FJCohen, DEssenburg, ADKaplan, HR Synthesis and biological activity of modified peptide inhibitors of angiotensin-converting enzyme. J Med Chem 28:1291-5 (1985)  
Target
Name:
Angiotensin-converting enzyme
Synonyms:
ACE Angiotensin converting enzyme (ACE) Angiotensin-converting enzyme, soluble form CD_antigen=CD143 DCP1 Kininase II
Type:
Enzyme
Mol. Mass.:
149709.01
Organism:
Homo sapiens (Human)
Description:
Residue:
1306
  
Inhibitor
Name:
BDBM21642
Synonyms:
(2S)-1-[(2S)-2-methyl-3-sulfanylpropanoyl]pyrrolidine-2-carboxylic acid Capozide Lopirin SQ14534 | US11491146, Compound L-Captopril
Type:
Small organic molecule
Emp. Form.:
C9H15NO3S
Mol. Mass.:
217.285
SMILES:
C[C@H](CS)C(=O)N1CCC[C@H]1C(O)=O
: