Target
Angiotensin-converting enzyme
Ligand
BDBM50367254
Substrate
Meas. Tech.
ChEBML_36890
IC50
2.4±n/a nM
Citation
 Klutchko, SBlankley, CJFleming, RWHinkley, JMWerner, AENordin, IHolmes, AHoefle, MLCohen, DMEssenburg, AD Synthesis of novel angiotensin converting enzyme inhibitor quinapril and related compounds. A divergence of structure-activity relationships for non-sulfhydryl and sulfhydryl types. J Med Chem 29:1953-61 (1986)  
Target
Name:
Angiotensin-converting enzyme
Synonyms:
ACE Angiotensin converting enzyme (ACE) Angiotensin-converting enzyme, soluble form CD_antigen=CD143 DCP1 Kininase II
Type:
Enzyme
Mol. Mass.:
149709.01
Organism:
Homo sapiens (Human)
Description:
Residue:
1306
  
Inhibitor
Name:
BDBM50367254
Synonyms:
ENALAPRILAT
Type:
Small organic molecule
Emp. Form.:
C18H24N2O5
Mol. Mass.:
348.3936
SMILES:
C[C@H](N[C@@H](CCc1ccccc1)C(O)=O)C(=O)N1CCC[C@H]1C(O)=O
: