Target
Cathepsin D
Ligand
BDBM50025528
Substrate
Meas. Tech.
ChEBML_45141
Ki
1.1±n/a nM
Citation
 Agarwal, NSRich, DH Inhibition of cathepsin D by substrate analogues containing statine and by analogues of pepstatin. J Med Chem 29:2519-24 (1987)  
Target
Name:
Cathepsin D
Synonyms:
CATD_BOVIN | CTSD
Type:
PROTEIN
Mol. Mass.:
42158.92
Organism:
Bos taurus
Description:
ChEMBL_1458606
Residue:
387
  
Inhibitor
Name:
BDBM50025528
Synonyms:
2-[2-(4-{2-[2-(2-tert-Butoxycarbonylamino-3-phenyl-propionylamino)-propionylamino]-4-methyl-pentanoylamino}-3-hydroxy-6-methyl-heptanoylamino)-3-methyl-butyrylamino]-4-methyl-pentanoic acid methyl ester | CHEMBL3142508
Type:
Small organic molecule
Emp. Form.:
C43H72N6O10
Mol. Mass.:
833.066
SMILES:
COC(=O)[C@H](CC(C)C)NC(=O)[C@@H](NC(=O)C[C@H](O)[C@H](CC(C)C)NC(=O)[C@H](CC(C)C)NC(=O)[C@H](C)NC(=O)[C@H](Cc1ccccc1)NC(=O)OC(C)(C)C)C(C)C
: