Target
Voltage-dependent L-type calcium channel subunit alpha-1C
Ligand
BDBM78577
Substrate
Meas. Tech.
ChEBML_42776
IC50
22000±n/a nM
Citation
 Sanfilippo, PJUrbanski, MPress, JBDubinsky, BMoore, JB Synthesis of (aryloxy)alkylamines. 2. Novel imidazo-fused heterocycles with calcium channel blocking and local anesthetic activity. J Med Chem 31:2221-7 (1988)  
Target
Name:
Voltage-dependent L-type calcium channel subunit alpha-1C
Synonyms:
CAC1C_RABIT CACN2 CACNL1A1 L-type calcium channel alpha 1C/beta 2A | Voltage-gated L-type calcium channel alpha-1C subunit
Type:
PROTEIN
Mol. Mass.:
242793.78
Organism:
Oryctolagus cuniculus
Description:
ChEMBL_42776
Residue:
2171
  
Inhibitor
Name:
BDBM78577
Synonyms:
BEPRIDIL HYDROCHLORIDE MLS000028456 N-[3-(2-methylpropoxy)-2-pyrrolidin-1-yl-propyl]-N-(phenylmethyl)aniline;hydrochloride SMR000058419 cid_50088
Type:
Small organic molecule
Emp. Form.:
C24H34N2O
Mol. Mass.:
366.5396
SMILES:
CC(C)COCC(CN(Cc1ccccc1)c1ccccc1)N1CCCC1
: