Target
Adenosine receptor A2a/A2b
Ligand
BDBM50023397
Substrate
Meas. Tech.
ChEMBL_27927 (CHEMBL642335)
Ki
5300±n/a nM
Citation
 Linden, JPatel, AEarl, CQCraig, RHDaluge, SM 125I-labeled 8-phenylxanthine derivatives: antagonist radioligands for adenosine A1 receptors. J Med Chem 31:745-51 (1988)  
Target
Name:
Adenosine receptor A2a/A2b
Synonyms:
Adenosine A2 receptor
Type:
Mol. Mass.:
Description:
ASSAY_ID of ChEMBL is 329906
Components:
This complex has 2 components.
Component 1
Name:
Adenosine receptor A2b
Synonyms:
AA2BR_HUMAN ADORA2B Adenosine receptors A2b | Adenosine receptors; A2a & A2b
Type:
G Protein-Coupled Receptor (GPCR)
Mol. Mass.:
36341.22
Organism:
Homo sapiens (Human)
Description:
Residue:
332
  
Component 2
Name:
Adenosine receptor A2a
Synonyms:
A2A adenosine receptor (hA2A) ADENOSINE A2 ADORA2 Adenosine A2A receptor (A2AAR)
Type:
G Protein-Coupled Receptor (GPCR)
Mol. Mass.:
44716.46
Organism:
Homo sapiens (Human)
Description:
P29274
Residue:
412
  
Inhibitor
Name:
BDBM50023397
Synonyms:
CHEMBL162558 | {4-[1-(4-Azido-3-iodo-benzyl)-2,6-dioxo-3-propyl-2,3,6,9-tetrahydro-1H-purin-8-yl]-phenoxy}-acetic acid
Type:
Small organic molecule
Emp. Form.:
C23H20IN7O5
Mol. Mass.:
601.3533
SMILES:
CCCn1c2nc([nH]c2c(=O)n(Cc2ccc(N=[N+]=[N-])c(I)c2)c1=O)-c1ccc(OCC(O)=O)cc1
: