Target
Polyunsaturated fatty acid 5-lipoxygenase
Ligand
BDBM85245
Substrate
Meas. Tech.
ChEBML_3966
IC50
>100000±n/a nM
Citation
 Clemence, FLe Martret, ODelevallee, FBenzoni, JJouanen, AJouquey, SMouren, MDeraedt, R 4-Hydroxy-3-quinolinecarboxamides with antiarthritic and analgesic activities. J Med Chem 31:1453-62 (1988)  
Target
Name:
Polyunsaturated fatty acid 5-lipoxygenase
Synonyms:
Alox5 LOX5_RAT
Type:
PROTEIN
Mol. Mass.:
78082.31
Organism:
Rattus norvegicus
Description:
ChEMBL_1432947
Residue:
673
  
Inhibitor
Name:
BDBM85245
Synonyms:
CAS_36322-90-4 Piroxicam
Type:
Small organic molecule
Emp. Form.:
C15H13N3O4S
Mol. Mass.:
331.346
SMILES:
CN1C(C(=O)Nc2ccccn2)=C(O)c2ccccc2S1(=O)=O
: