Target
Potassium-transporting ATPase alpha chain 1/subunit beta
Ligand
BDBM22889
Substrate
Meas. Tech.
ChEMBL_164918 (CHEMBL872006)
IC50
>100000±n/a nM
Citation
 Sanfilippo, PJUrbanski, MPress, JBHajos, ZGShriver, DAScott, CK Synthesis of (aryloxy)alkylamines. 1. Novel antisecretory agents with H+K+-ATPase inhibitory activity. J Med Chem 31:1778-85 (1988)  
Target
Name:
Potassium-transporting ATPase alpha chain 1/subunit beta
Synonyms:
Potassium-transporting ATPase | Potassium-transporting ATPase alpha chain 1/beta chain
Type:
Mol. Mass.:
Description:
ASSAY_ID of EBI is 71495
Components:
This complex has 2 components.
Component 1
Name:
Potassium-transporting ATPase alpha chain 1
Synonyms:
ATP4A Gastric H(+)/K(+) ATPase subunit alpha Potassium-transporting ATPase alpha chain 1 | Proton pump
Type:
PROTEIN
Mol. Mass.:
114109.05
Organism:
Homo sapiens (Human)
Description:
EBI_82
Residue:
1035
  
Component 2
Name:
Potassium-transporting ATPase subunit beta
Synonyms:
ATP4B Gastric H(+)/K(+) ATPase subunit beta Potassium-transporting ATPase subunit beta | Proton pump beta chain
Type:
PROTEIN
Mol. Mass.:
33369.83
Organism:
Homo sapiens (Human)
Description:
EBI_10719
Residue:
291
  
Inhibitor
Name:
BDBM22889
Synonyms:
(Cimetidine) N-Methyl-N''''-[2-(5-methyl-1H-imidazol-4-ylmethylsulfanyl)-ethyl]-guanidine,cyanide (cimetidine) N-methyl-N-[2-(5-methyl-1H-4-imidazolylmethylsulfanyl)ethyl]cyanoiminomethanediamine 1-cyano-2-methyl-3-(2-{[(5-methyl-1H-imidazol-4-yl)methyl]sulfanyl}ethyl)guanidine 2-Methyl-8-phenethyl-imidazo[1,2-a]pyridine-3-carboxylic acid methyl ester(cimetidine) 2-methylamino-2-[2-(5-methyl-1H-4-imidazolylmethylsulfanyl)ethylamino]-(Z)-1-imino cyanide(cimetidine) CHEMBL30 Eureceptor N''''''''-cyano-N-methyl-N''''-(2-{[(5-methyl-1H-imidazol-4-yl)methyl]-lambda~4~-sulfanyl}ethyl)guanidine N''''''''-cyano-N-methyl-N''''-(2-{[(5-methyl-1H-imidazol-4-yl)methyl]thio}ethyl)guanidine (Cimetidine) N''''''''-cyano-N-methyl-N''''-({[(5-methyl-1H-imidazol-4-yl)methyl]thio}methyl)guanidine(cimetidine) N-Methyl-N''''-[2-(5-methyl-1H-imidazol-4-ylmethylsulfanyl)-ethyl]-N''''''''-Cyano-guanidine N-Methyl-N''''-[2-(5-methyl-1H-imidazol-4-ylmethylsulfanyl)-ethyl]-cyanoguanidine(cimetidine) N-methyl-N''''-cyano-N''''''''-[2-(5-methyl-1H-imidazol-4-ylmethylsulfanyl)-ethyl]-guanidine N-methyl-N-[2-(5-methyl-1H-4-imidazolylmethylsulfanyl)ethyl]cyanoiminomethanediamine (cimetidine) N-tert-Butyl-N''''-[4-(1H-imidazol-4-yl)-phenyl]-formamidine(cimetidine) Tagamet HB cemitidine
Type:
Small organic molecule
Emp. Form.:
C10H16N6S
Mol. Mass.:
252.339
SMILES:
CNC(NC#N)=NCCSCc1[nH]cnc1C
: