Target
Chymotrypsinogen A
Ligand
BDBM50014576
Substrate
Meas. Tech.
ChEBML_216617
Ki
130±n/a nM
Citation
 Angelastro, MRMehdi, SBurkhart, JPPeet, NPBey, P Alpha-diketone and alpha-keto ester derivatives of N-protected amino acids and peptides as novel inhibitors of cysteine and serine proteinases. J Med Chem 33:11-3 (1990)  
Target
Name:
Chymotrypsinogen A
Synonyms:
Alpha-chymotrypsin Chymotrypsin A Chymotrypsin A chain B Chymotrypsinogen A | alpha-Chymotrypsin (α-Chymotrypsin)
Type:
Serine protease
Mol. Mass.:
25670.88
Organism:
Bos taurus (bovine)
Description:
Residue:
245
  
Inhibitor
Name:
BDBM50014576
Synonyms:
3-Benzyloxycarbonylamino-2-oxo-4-phenyl-butyric acid ethyl ester | CHEMBL277191
Type:
Small organic molecule
Emp. Form.:
C20H21NO5
Mol. Mass.:
355.3844
SMILES:
CCOC(=O)C(=O)[C@H](Cc1ccccc1)NC(=O)OCc1ccccc1
: