Target
3-hydroxy-3-methylglutaryl-coenzyme A reductase
Ligand
BDBM50014345
Substrate
Meas. Tech.
ChEMBL_80668 (CHEMBL691797)
IC50
>300000±n/a nM
Citation
 Sit, SYParker, RAMotoc, IHan, WBalasubramanian, NCatt, JDBrown, PJHarte, WEThompson, MDWright, JJ Synthesis, biological profile, and quantitative structure-activity relationship of a series of novel 3-hydroxy-3-methylglutaryl coenzyme A reductase inhibitors. J Med Chem 33:2982-99 (1990)  
Target
Name:
3-hydroxy-3-methylglutaryl-coenzyme A reductase
Synonyms:
HMDH_RAT Hmgcr
Type:
Enzyme
Mol. Mass.:
96689.85
Organism:
Rattus norvegicus (rat)
Description:
Isolated rat liver microsomes were used as enzyme source.
Residue:
887
  
Inhibitor
Name:
BDBM50014345
Synonyms:
CHEMBL11804 Sodium; 9,9-bis-(4-fluoro-phenyl)-3,5-dihydroxy-8-(1-methyl-1H-tetrazol-5-yl)-nona-6,8-dienoate
Type:
Small organic molecule
Emp. Form.:
C23H21F2N4O4
Mol. Mass.:
455.4346
SMILES:
[#6]-n1nnnc1\[#6](\[#6]=[#6]\[#6@@H](-[#8])-[#6]-[#6@@H](-[#8])-[#6]-[#6](-[#8-])=O)=[#6](\c1ccc(F)cc1)-c1ccc(F)cc1
: