Target
3-hydroxy-3-methylglutaryl-coenzyme A reductase
Ligand
BDBM50014363
Substrate
Meas. Tech.
ChEBML_80668
IC50
330±n/a nM
Citation
 Sit, SYParker, RAMotoc, IHan, WBalasubramanian, NCatt, JDBrown, PJHarte, WEThompson, MDWright, JJ Synthesis, biological profile, and quantitative structure-activity relationship of a series of novel 3-hydroxy-3-methylglutaryl coenzyme A reductase inhibitors. J Med Chem 33:2982-99 (1990)  
Target
Name:
3-hydroxy-3-methylglutaryl-coenzyme A reductase
Synonyms:
HMDH_RAT Hmgcr
Type:
Enzyme
Mol. Mass.:
96689.85
Organism:
Rattus norvegicus (rat)
Description:
Isolated rat liver microsomes were used as enzyme source.
Residue:
887
  
Inhibitor
Name:
BDBM50014363
Synonyms:
CHEMBL419542 | Sodium; 9,9-bis-(4-fluoro-phenyl)-3,5-dihydroxy-8-(5H-tetrazol-5-yl)-nona-6,8-dienoate
Type:
Small organic molecule
Emp. Form.:
C22H19F2N4O4
Mol. Mass.:
441.408
SMILES:
O[C@H](C[C@H](O)C=CC(=C(c1ccc(F)cc1)c1ccc(F)cc1)c1nnn[nH]1)CC([O-])=O
: