Target
3-hydroxy-3-methylglutaryl-coenzyme A reductase
Ligand
BDBM50014361
Substrate
Meas. Tech.
ChEBML_80668
IC50
190±n/a nM
Citation
 Sit, SYParker, RAMotoc, IHan, WBalasubramanian, NCatt, JDBrown, PJHarte, WEThompson, MDWright, JJ Synthesis, biological profile, and quantitative structure-activity relationship of a series of novel 3-hydroxy-3-methylglutaryl coenzyme A reductase inhibitors. J Med Chem 33:2982-99 (1990)  
Target
Name:
3-hydroxy-3-methylglutaryl-coenzyme A reductase
Synonyms:
HMDH_RAT Hmgcr
Type:
Enzyme
Mol. Mass.:
96689.85
Organism:
Rattus norvegicus (rat)
Description:
Isolated rat liver microsomes were used as enzyme source.
Residue:
887
  
Inhibitor
Name:
BDBM50014361
Synonyms:
CHEMBL318754 | Sodium; 3,5-dihydroxy-8-(1-methyl-1H-tetrazol-5-yl)-9,9-diphenyl-nona-6,8-dienoate
Type:
Small organic molecule
Emp. Form.:
C23H23N4O4
Mol. Mass.:
419.4537
SMILES:
[#6]-n1nnnc1\[#6](\[#6]=[#6]\[#6@@H](-[#8])-[#6]-[#6@@H](-[#8])-[#6]-[#6](-[#8-])=O)=[#6](/c1ccccc1)-c1ccccc1
: