Target
Adenosine receptor A2a/A2b
Ligand
BDBM50015798
Substrate
Meas. Tech.
ChEMBL_30535 (CHEMBL643182)
IC50
44±n/a nM
Citation
 Sarges, RHoward, HRBrowne, RGLebel, LASeymour, PAKoe, BK 4-Amino[1,2,4]triazolo[4,3-a]quinoxalines. A novel class of potent adenosine receptor antagonists and potential rapid-onset antidepressants. J Med Chem 33:2240-54 (1990)  
Target
Name:
Adenosine receptor A2a/A2b
Synonyms:
Adenosine A2 receptor
Type:
Mol. Mass.:
Description:
ASSAY_ID of ChEMBL is 30560
Components:
This complex has 2 components.
Component 1
Name:
Adenosine receptor A2b
Synonyms:
AA2BR_RAT Adora2b
Type:
PROTEIN
Mol. Mass.:
36378.84
Organism:
Rattus norvegicus
Description:
ChEMBL_32934
Residue:
332
  
Component 2
Name:
Adenosine receptor A2a
Synonyms:
AA2AR_RAT Adenosine A2 receptor Adenosine Receptors A2a (A2a) Adenosine receptors A2a Rat striatal adenosine A2a receptor
Type:
G Protein-Coupled Receptor (GPCR)
Mol. Mass.:
45015.65
Organism:
Rattus norvegicus (rat)
Description:
Rat A2A receptors expressed in CHO cells.
Residue:
410
  
Inhibitor
Name:
BDBM50015798
Synonyms:
8-Chloro-1-trifluoromethyl-[1,2,4]triazolo[4,3-a]quinoxalin-4-ylamine | CHEMBL307187
Type:
Small organic molecule
Emp. Form.:
C10H5ClF3N5
Mol. Mass.:
287.628
SMILES:
Nc1nc2ccc(Cl)cc2n2c(nnc12)C(F)(F)F
: