Target
Muscarinic acetylcholine receptor M1
Ligand
BDBM50403547
Substrate
Meas. Tech.
ChEMBL_138140 (CHEMBL747398)
Ki
0.329000±n/a nM
Citation
 Carroll, FIAbraham, PMascarella, SWSingh, PMoreland, CGSankar, SSKwon, YWTriggle, DJ Crystal, solution, and molecular modeling structural properties and muscarinic antagonist activity of azaprophen. J Med Chem 34:1436-40 (1991)  
Target
Name:
Muscarinic acetylcholine receptor M1
Synonyms:
ACM1_HUMAN Cholinergic receptor, muscarinic 1 | Cholinergic, muscarinic M1
Type:
Protein
Mol. Mass.:
51442.54
Organism:
Homo sapiens (Human)
Description:
P11229
Residue:
460
  
Inhibitor
Name:
BDBM50403547
Synonyms:
ATROPEN | ATROPINE
Type:
Small organic molecule
Emp. Form.:
C17H23NO3
Mol. Mass.:
289.3694
SMILES:
CN1[C@H]2CC[C@@H]1C[C@@H](C2)OC(=O)C(CO)c1ccccc1
: