Target
Acetylcholinesterase
Ligand
BDBM50313079
Substrate
Meas. Tech.
ChEBML_27815
IC50
50±n/a nM
Citation
 Cannon, JGSahin, MFBhatnagar, RKFlynn, JRLong, JP Structure-activity studies on a potent antagonist to organophosphate-induced toxicity. J Med Chem 34:1582-4 (1991)  
Target
Name:
Acetylcholinesterase
Synonyms:
ACES_BOVIN Acetylcholinesterase (AChE) | Acetylcholinesterase precursor
Type:
Enzyme
Mol. Mass.:
67659.62
Organism:
Bos taurus (bovine)
Description:
Residue:
613
  
Inhibitor
Name:
BDBM50313079
Synonyms:
3-Dimethylcarbamoyloxy-1-methyl-pyridinium; bromide Mestinon Pyridostigmine Regonol
Type:
Small organic molecule
Emp. Form.:
C9H13N2O2
Mol. Mass.:
181.2112
SMILES:
CN(C)C(=O)Oc1ccc[n+](C)c1
: