Target
Mu-type opioid receptor
Ligand
BDBM50009184
Substrate
Meas. Tech.
ChEMBL_146982 (CHEMBL757521)
IC50
130±n/a nM
Citation
 Salvadori, SMarastoni, MBalboni, GBorea, PAMorari, MTomatis, R Synthesis and structure-activity relationships of deltorphin analogues. J Med Chem 34:1656-61 (1991)  
Target
Name:
Mu-type opioid receptor
Synonyms:
M-OR-1 Mu opioid receptor OPIATE Mu OPRM_CAVPO
Type:
Enzyme Catalytic Domain
Mol. Mass.:
11165.58
Organism:
GUINEA PIG
Description:
P97266
Residue:
98
  
Inhibitor
Name:
BDBM50009184
Synonyms:
3-(2-{2-[2-(2-{2-[2-Amino-3-(4-hydroxy-phenyl)-propionylamino]-propionylamino}-3-phenyl-propionylamino)-acetylamino]-3-methyl-butyrylamino}-butyrylamino)-succinamic acid | CHEMBL2372709
Type:
Small organic molecule
Emp. Form.:
C36H50N8O10
Mol. Mass.:
754.8298
SMILES:
CC[C@H](NC(=O)[C@@H](NC(=O)CNC(=O)[C@H](Cc1ccccc1)NC(=O)[C@H](C)NC(=O)[C@@H](N)Cc1ccc(O)cc1)C(C)C)C(=O)N[C@@H](CC(O)=O)C(N)=O
: