Target
Delta-type opioid receptor
Ligand
BDBM50006947
Substrate
Meas. Tech.
ChEMBL_147157 (CHEMBL758768)
Ki
0.013000±n/a nM
Citation
 Portoghese, PS An approach to the design of receptor-type-selective non-peptide antagonists of peptidergic receptors: delta opioid antagonists. J Med Chem 34:1757-62 (1991)  
Target
Name:
Delta-type opioid receptor
Synonyms:
D-OR-1 Delta opioid receptor OPIATE Delta OPRD1 OPRK1 | opioid receptor, delta 1
Type:
G Protein-Coupled Receptor (GPCR)
Mol. Mass.:
40382.98
Organism:
Homo sapiens (Human)
Description:
Competition binding assays were carried out using membrane preparations from transfected HN9.10 cells that constitutively expressed the delta opioid receptor.
Residue:
372
  
Inhibitor
Name:
BDBM50006947
Synonyms:
22-cyclopropylmethyl-(1S,2S,13R)-11,14-dioxa-22-azaheptacyclo[13.9.1.01,13.02,21.04,12.05,10.019,25]pentacosa-4(12),5(10),6,8,15,17,19(25)-heptaene-2,16-diol | 22-cyclopropylmethyl-11,14-dioxa-22-azaheptacyclo[13.9.1.01,13.02,21.04,12.05,10.019,25]pentacosa-4(12),5(10),6,8,15,17,19(25)-heptaene-2,16-diol
Type:
Small organic molecule
Emp. Form.:
C26H25NO4
Mol. Mass.:
415.481
SMILES:
Oc1ccc2CC3N(CC4CC4)CC[C@@]45[C@@H](Oc1c24)c1oc2ccccc2c1C[C@@]35O
: