Target
Glucocorticoid receptor
Ligand
BDBM50421892
Substrate
Meas. Tech.
ChEBML_71420
IC50
5.3±n/a nM
Citation
 Ueno, HMaruyama, AMiyake, MNakao, ENakao, KUmezu, KNitta, I Synthesis and evaluation of antiinflammatory activities of a series of corticosteroid 17 alpha-esters containing a functional group. J Med Chem 34:2468-73 (1991)  
Target
Name:
Glucocorticoid receptor
Synonyms:
GCR_RAT Glucocorticoid Receptor (GR) Grl | Nr3c1
Type:
Enzyme Catalytic Domain
Mol. Mass.:
87556.83
Organism:
RAT
Description:
Glucocorticoid 0 RAT::P06536
Residue:
795
  
Inhibitor
Name:
BDBM50421892
Synonyms:
Alphatrex Diprolene Diprosone | SCH-11460
Type:
Small organic molecule
Emp. Form.:
C28H37FO7
Mol. Mass.:
504.5876
SMILES:
CCC(=O)OCC(=O)[C@@]1(OC(=O)CC)[C@@H](C)C[C@H]2[C@@H]3CCC4=CC(=O)C=C[C@]4(C)[C@@]3(F)[C@@H](O)C[C@]12C
: