Target
Mu-type opioid receptor
Ligand
BDBM50001093
Substrate
Meas. Tech.
ChEBML_146542
Ki
11.0±n/a nM
Citation
 Chandrakumar, NSStapelfeld, ABeardsley, PMLopez, OTDrury, BAnthony, ESavage, MAWilliamson, LNReichman, M Analogs of the delta opioid receptor selective cyclic peptide [2-D-penicillamine,5-D-penicillamine]-enkephalin: 2',6'-dimethyltyrosine and Gly3-Phe4 amide bond isostere substitutions. J Med Chem 35:2928-38 (1992)  
Target
Name:
Mu-type opioid receptor
Synonyms:
MOR-1 Mu-type opioid receptor (MOR) OPRM_RAT Opioid receptor B Ror-b
Type:
G Protein-Coupled Receptor (GPCR)
Mol. Mass.:
44503.11
Organism:
Rattus norvegicus (rat)
Description:
Competition binding assays were carried out using membrane preparations from transfected HN9.10 cells that constitutively expressed the mu opioid receptor.
Residue:
398
  
Inhibitor
Name:
BDBM50001093
Synonyms:
13-[2-Amino-3-(4-hydroxy-2,6-dimethyl-phenyl)-propionylamino]-7-benzyl-3,3,14,14-tetramethyl-6,12-dioxo-1,2-dithia-5,11-diaza-cyclotetradecane-4-carboxylic acid methyl ester; hydrochloride | CHEMBL553149
Type:
Small organic molecule
Emp. Form.:
C34H48N4O6S2
Mol. Mass.:
672.898
SMILES:
COC(=O)[C@H]1NC(=O)C(Cc2ccccc2)CCCNC(=O)[C@@H](NC(=O)[C@@H](N)Cc2c(C)cc(O)cc2C)C(C)(C)SSC1(C)C
: