Target
D(2) dopamine receptor
Ligand
BDBM50002234
Substrate
Meas. Tech.
ChEBML_58197
IC50
55±n/a nM
Citation
 Gilligan, PJCain, GAChristos, TECook, LDrummond, SJohnson, ALKergaye, AAMcElroy, JFRohrbach, KWSchmidt, WK Novel piperidine sigma receptor ligands as potential antipsychotic drugs. J Med Chem 35:4344-61 (1992)  
Target
Name:
D(2) dopamine receptor
Synonyms:
DOPAMINE D2 Dopamine D2 receptor Drd2
Type:
Enzyme
Mol. Mass.:
50957.64
Organism:
Mus musculus (Mouse)
Description:
P61168
Residue:
444
  
Inhibitor
Name:
BDBM50002234
Synonyms:
1-(4-Fluoro-phenyl)-4-{4-[2-(4-fluoro-phenyl)-acetyl]-piperidin-1-yl}-butan-1-one | CHEMBL136509
Type:
Small organic molecule
Emp. Form.:
C23H25F2NO2
Mol. Mass.:
385.4469
SMILES:
Fc1ccc(CC(=O)C2CCN(CCCC(=O)c3ccc(F)cc3)CC2)cc1
: