Target
Muscarinic acetylcholine receptor M2
Ligand
BDBM50005677
Substrate
Meas. Tech.
ChEMBL_98894 (CHEMBL703402)
Ki
0.780000±n/a nM
Citation
 Trybulski, EJZhang, JKramss, RHMangano, RM The synthesis and biochemical pharmacology of enantiomerically pure methylated oxotremorine derivatives. J Med Chem 36:3533-41 (1994)  
Target
Name:
Muscarinic acetylcholine receptor M2
Synonyms:
ACM2_RAT Chrm-2 | Chrm2
Type:
Enzyme Catalytic Domain
Mol. Mass.:
51555.53
Organism:
RAT
Description:
P10980
Residue:
466
  
Inhibitor
Name:
BDBM50005677
Synonyms:
CHEMBL23957 Trimethyl-[4-(2-oxo-pyrrolidin-1-yl)-but-2-ynyl]-ammonium; iodide
Type:
Small organic molecule
Emp. Form.:
C11H19N2O
Mol. Mass.:
195.2808
SMILES:
C[N+](C)(C)CC#CCN1CCCC1=O
: