Target
D(2) dopamine receptor
Ligand
BDBM50456207
Substrate
Meas. Tech.
ChEBML_62882
Ki
0.028000±n/a nM
Citation
 Mach, RHLuedtke, RRUnsworth, CDBoundy, VANowak, PAScripko, JGElder, STJackson, JRHoffman, PLEvora, PH 18F-labeled benzamides for studying the dopamine D2 receptor with positron emission tomography. J Med Chem 36:3707-20 (1994)  
Target
Name:
D(2) dopamine receptor
Synonyms:
DOPAMINE D2 DOPAMINE D2 Short Dopamine D2 receptor Drd2
Type:
G Protein-Coupled Receptor (GPCR)
Mol. Mass.:
50931.60
Organism:
Rattus norvegicus (rat)
Description:
P61169
Residue:
444
  
Inhibitor
Name:
BDBM50456207
Synonyms:
CHEMBL2112607
Type:
Small organic molecule
Emp. Form.:
C24H29FN2O3
Mol. Mass.:
412.4971
SMILES:
COc1cccc(C(=O)NC2CC3CCCC(C2)N3Cc2ccc(F)cc2)c1OC
: