Target
cGMP-specific 3',5'-cyclic phosphodiesterase
Ligand
BDBM23620
Substrate
Meas. Tech.
ChEBML_217516
IC50
520±n/a nM
Citation
 Takase, YSaeki, TFujimoto, MSaito, I Cyclic GMP phosphodiesterase inhibitors. 1. The discovery of a novel potent inhibitor, 4-((3,4-(methylenedioxy)benzyl)amino)-6,7,8-trimethoxyquinazoline. J Med Chem 36:3765-70 (1994)  
Target
Name:
cGMP-specific 3',5'-cyclic phosphodiesterase
Synonyms:
3',5'-cyclic phosphodiesterase PDE5 PDE5A_HUMAN Phosphodiesterase 5 (PDE5) Phosphodiesterase 5A (PDE5A) cGMP-specific 3',5'-cyclic phosphodiesterase
Type:
Protein
Mol. Mass.:
99975.83
Organism:
Homo sapiens (Human)
Description:
O76074
Residue:
875
  
Inhibitor
Name:
BDBM23620
Synonyms:
2-({6-[bis(2-hydroxyethyl)amino]-4,8-bis(piperidin-1-yl)pyrimido[5,4-d][1,3]diazin-2-yl}(2-hydroxyethyl)amino)ethan-1-ol Dipyridamine Dipyudamine Persantine cid_3108
Type:
Small organic molecule
Emp. Form.:
C24H40N8O4
Mol. Mass.:
504.6256
SMILES:
OCCN(CCO)c1nc(N2CCCCC2)c2nc(nc(N3CCCCC3)c2n1)N(CCO)CCO
: