Target
Histamine H2 receptor
Ligand
BDBM22893
Substrate
Meas. Tech.
ChEMBL_85063 (CHEMBL690997)
IC50
3400±n/a nM
Citation
 Katsura, YInoue, YTomishi, TIshikawa, HTakasugi, H Studies on antiulcer drugs. 7. 2-Guanidino-4-pyridylthiazoles as histamine H2-receptor antagonists with potent gastroprotective effects against nonsteroidal antiinflammatory drug-induced injury. J Med Chem 37:57-66 (1994)  
Target
Name:
Histamine H2 receptor
Synonyms:
Gastric receptor I HISTAMINE H2 HRH2_CAVPO | Histamine H2-Gs alpha S
Type:
G Protein-Coupled Receptor (GPCR)
Mol. Mass.:
40567.22
Organism:
Cavia porcellus (domestic guinea pig)
Description:
For the H2 receptor-binding assays, guinea pig striatum was used.
Residue:
359
  
Inhibitor
Name:
BDBM22893
Synonyms:
CHEMBL512 ZANTAC | dimethyl[(5-{[(2-{[(E)-1-(methylamino)-2-nitroethenyl]amino}ethyl)sulfanyl]methyl}furan-2-yl)methyl]amine
Type:
Small organic molecule
Emp. Form.:
C13H22N4O3S
Mol. Mass.:
314.404
SMILES:
CN\C([CH-][N+]([O-])=O)=[NH+]/CCSCc1ccc(CN(C)C)o1
: