Target
Adenosine receptor A1
Ligand
BDBM50453669
Substrate
Meas. Tech.
ChEMBL_29762 (CHEMBL875506)
Ki
778±n/a nM
Citation
 Jacobson, KASiddiqi, SMOlah, MEJi, XDMelman, NBellamkonda, KMeshulam, YStiles, GLKim, HO Structure-activity relationships of 9-alkyladenine and ribose-modified adenosine derivatives at rat A3 adenosine receptors. J Med Chem 38:1720-35 (1995)  
Target
Name:
Adenosine receptor A1
Synonyms:
AA1R_RAT ADENOSINE A1 high Adenosine A1 receptor (A1) Adenosine receptors A1 | Adora1
Type:
Protein
Mol. Mass.:
36704.13
Organism:
Rattus norvegicus (rat)
Description:
Residue:
326
  
Inhibitor
Name:
BDBM50453669
Synonyms:
CHEMBL2113699
Type:
Small organic molecule
Emp. Form.:
C20H20ClIN6O4
Mol. Mass.:
570.768
SMILES:
CNC(=O)[C@@H]1C[C@@H](OC(C)=O)[C@@H](O1)n1cnc2c(NCc3cccc(I)c3)nc(Cl)nc12
: