Target
Adenosine receptor A2a
Ligand
BDBM50453667
Substrate
Meas. Tech.
ChEMBL_31071 (CHEMBL640431)
Ki
1640±n/a nM
Citation
 Jacobson, KASiddiqi, SMOlah, MEJi, XDMelman, NBellamkonda, KMeshulam, YStiles, GLKim, HO Structure-activity relationships of 9-alkyladenine and ribose-modified adenosine derivatives at rat A3 adenosine receptors. J Med Chem 38:1720-35 (1995)  
Target
Name:
Adenosine receptor A2a
Synonyms:
AA2AR_RAT Adenosine A2 receptor Adenosine Receptors A2a (A2a) Adenosine receptors A2a Rat striatal adenosine A2a receptor
Type:
G Protein-Coupled Receptor (GPCR)
Mol. Mass.:
45015.65
Organism:
Rattus norvegicus (rat)
Description:
Rat A2A receptors expressed in CHO cells.
Residue:
410
  
Inhibitor
Name:
BDBM50453667
Synonyms:
CHEMBL2113687
Type:
Small organic molecule
Emp. Form.:
C14H14IN5S
Mol. Mass.:
411.264
SMILES:
CSc1nc(NCc2cccc(I)c2)c2ncn(C)c2n1
: