Target
Adenosine receptor A2a
Ligand
BDBM50453666
Substrate
Meas. Tech.
ChEMBL_31071 (CHEMBL640431)
Ki
78900±n/a nM
Citation
 Jacobson, KASiddiqi, SMOlah, MEJi, XDMelman, NBellamkonda, KMeshulam, YStiles, GLKim, HO Structure-activity relationships of 9-alkyladenine and ribose-modified adenosine derivatives at rat A3 adenosine receptors. J Med Chem 38:1720-35 (1995)  
Target
Name:
Adenosine receptor A2a
Synonyms:
AA2AR_RAT Adenosine A2 receptor Adenosine Receptors A2a (A2a) Adenosine receptors A2a Rat striatal adenosine A2a receptor
Type:
G Protein-Coupled Receptor (GPCR)
Mol. Mass.:
45015.65
Organism:
Rattus norvegicus (rat)
Description:
Rat A2A receptors expressed in CHO cells.
Residue:
410
  
Inhibitor
Name:
BDBM50453666
Synonyms:
CHEMBL2113685
Type:
Small organic molecule
Emp. Form.:
C16H18IN5O2S
Mol. Mass.:
471.316
SMILES:
CSc1nc(NCc2cccc(I)c2)c2ncn(C[C@H](O)CO)c2n1
: