Target
Adenosine receptor A3
Ligand
BDBM50453672
Substrate
Meas. Tech.
ChEMBL_30616 (CHEMBL642023)
Ki
51000±n/a nM
Citation
 Jacobson, KASiddiqi, SMOlah, MEJi, XDMelman, NBellamkonda, KMeshulam, YStiles, GLKim, HO Structure-activity relationships of 9-alkyladenine and ribose-modified adenosine derivatives at rat A3 adenosine receptors. J Med Chem 38:1720-35 (1995)  
Target
Name:
Adenosine receptor A3
Synonyms:
AA3R_RAT Adenosine receptor A2a and A3 | Adora3
Type:
PROTEIN
Mol. Mass.:
36643.73
Organism:
Rattus norvegicus
Description:
ChEMBL_479910
Residue:
320
  
Inhibitor
Name:
BDBM50453672
Synonyms:
CHEMBL2113702
Type:
Small organic molecule
Emp. Form.:
C13H11ClIN5
Mol. Mass.:
399.617
SMILES:
Cn1cnc2c(NCc3cccc(I)c3)nc(Cl)nc12
: