Target
Adenosine receptor A1
Ligand
BDBM50453665
Substrate
Meas. Tech.
ChEMBL_29762 (CHEMBL875506)
Ki
811±n/a nM
Citation
 Jacobson, KASiddiqi, SMOlah, MEJi, XDMelman, NBellamkonda, KMeshulam, YStiles, GLKim, HO Structure-activity relationships of 9-alkyladenine and ribose-modified adenosine derivatives at rat A3 adenosine receptors. J Med Chem 38:1720-35 (1995)  
Target
Name:
Adenosine receptor A1
Synonyms:
AA1R_RAT ADENOSINE A1 high Adenosine A1 receptor (A1) Adenosine receptors A1 | Adora1
Type:
Protein
Mol. Mass.:
36704.13
Organism:
Rattus norvegicus (rat)
Description:
Residue:
326
  
Inhibitor
Name:
BDBM50453665
Synonyms:
CHEMBL2113415
Type:
Small organic molecule
Emp. Form.:
C16H13ClIN5O4
Mol. Mass.:
501.663
SMILES:
O[C@@H]1CO[C@H]([C@@H]1O)n1cnc2c(NC(=O)c3cccc(I)c3)nc(Cl)nc12
: