Target
Adenosine receptor A2a
Ligand
BDBM50453660
Substrate
Meas. Tech.
ChEMBL_31071 (CHEMBL640431)
Ki
3390±n/a nM
Citation
 Jacobson, KASiddiqi, SMOlah, MEJi, XDMelman, NBellamkonda, KMeshulam, YStiles, GLKim, HO Structure-activity relationships of 9-alkyladenine and ribose-modified adenosine derivatives at rat A3 adenosine receptors. J Med Chem 38:1720-35 (1995)  
Target
Name:
Adenosine receptor A2a
Synonyms:
AA2AR_RAT Adenosine A2 receptor Adenosine Receptors A2a (A2a) Adenosine receptors A2a Rat striatal adenosine A2a receptor
Type:
G Protein-Coupled Receptor (GPCR)
Mol. Mass.:
45015.65
Organism:
Rattus norvegicus (rat)
Description:
Rat A2A receptors expressed in CHO cells.
Residue:
410
  
Inhibitor
Name:
BDBM50453660
Synonyms:
CHEMBL2113397
Type:
Small organic molecule
Emp. Form.:
C17H17IN6O4
Mol. Mass.:
496.2592
SMILES:
CNc1nc(NC(=O)c2cccc(I)c2)c2ncn([C@@H]3OC[C@@H](O)[C@H]3O)c2n1
: