Target
Adenosine receptor A2a
Ligand
BDBM50368994
Substrate
Meas. Tech.
ChEMBL_31071 (CHEMBL640431)
Ki
54700±n/a nM
Citation
 Jacobson, KASiddiqi, SMOlah, MEJi, XDMelman, NBellamkonda, KMeshulam, YStiles, GLKim, HO Structure-activity relationships of 9-alkyladenine and ribose-modified adenosine derivatives at rat A3 adenosine receptors. J Med Chem 38:1720-35 (1995)  
Target
Name:
Adenosine receptor A2a
Synonyms:
AA2AR_RAT Adenosine A2 receptor Adenosine Receptors A2a (A2a) Adenosine receptors A2a Rat striatal adenosine A2a receptor
Type:
G Protein-Coupled Receptor (GPCR)
Mol. Mass.:
45015.65
Organism:
Rattus norvegicus (rat)
Description:
Rat A2A receptors expressed in CHO cells.
Residue:
410
  
Inhibitor
Name:
BDBM50368994
Synonyms:
CHEMBL1791403
Type:
Small organic molecule
Emp. Form.:
C11H15N5O4
Mol. Mass.:
281.2679
SMILES:
CC(O)[C@@H]1O[C@H]([C@H](O)[C@@H]1O)n1cnc2c(N)ncnc12
: