Target
3-oxo-5-alpha-steroid 4-dehydrogenase 2
Ligand
BDBM50031877
Substrate
Meas. Tech.
ChEMBL_204749 (CHEMBL805442)
Ki
0.17±n/a nM
Citation
 Frye, SVHaffner, CDMaloney, PRHiner, RNDorsey, GFNoe, RAUnwalla, RJBatchelor, KWBramson, HNStuart, JD Structure-activity relationships for inhibition of type 1 and 2 human 5 alpha-reductase and human adrenal 3 beta-hydroxy-delta 5-steroid dehydrogenase/3-keto-delta 5-steroid isomerase by 6-azaandrost-4-en-3-ones: optimization of the C17 substituent. J Med Chem 38:2621-7 (1995)  
Target
Name:
3-oxo-5-alpha-steroid 4-dehydrogenase 2
Synonyms:
S5A2_RAT Steroid 5-alpha-reductase | Steroid 5-alpha-reductase 2
Type:
PROTEIN
Mol. Mass.:
28784.15
Organism:
Rattus norvegicus
Description:
ChEMBL_205054
Residue:
254
  
Inhibitor
Name:
BDBM50031877
Synonyms:
(1S,9aR,11aS)-9a,11a-Dimethyl-7-oxo-2,3,3a,3b,4,5,7,8,9,9a,9b,10,11,11a-tetradecahydro-1H-cyclopenta[i]phenanthridine-1-carboxylic acid (2-tert-butyl-5-trifluoromethyl-phenyl)-amide | CHEMBL277224
Type:
Small organic molecule
Emp. Form.:
C30H39F3N2O2
Mol. Mass.:
516.6381
SMILES:
CC(C)(C)c1ccc(cc1NC(=O)[C@H]1CCC2C3CN=C4CC(=O)CC[C@]4(C)C3CC[C@]12C)C(F)(F)F
: