Target
Adenosine receptor A2a
Ligand
BDBM50205705
Substrate
Meas. Tech.
ChEMBL_30899 (CHEMBL645502)
EC50
>1±n/a nM
Citation
 Vittori, SCamaioni, EDi Francesco, EVolpini, RMonopoli, ADionisotti, SOngini, ECristalli, G 2-alkenyl and 2-alkyl derivatives of adenosine and adenosine-5'-N-ethyluronamide: different affinity and selectivity of E- and Z-diastereomers at A2A adenosine receptors. J Med Chem 39:4211-7 (1996)  
Target
Name:
Adenosine receptor A2a
Synonyms:
AA2AR_RAT Adenosine A2 receptor Adenosine Receptors A2a (A2a) Adenosine receptors A2a Rat striatal adenosine A2a receptor
Type:
G Protein-Coupled Receptor (GPCR)
Mol. Mass.:
45015.65
Organism:
Rattus norvegicus (rat)
Description:
Rat A2A receptors expressed in CHO cells.
Residue:
410
  
Inhibitor
Name:
BDBM50205705
Synonyms:
(2S,3S,4R)-5-((R)-6-amino-2-phenylethynyl-9H-purin-3-yl)-3,4-dihydroxy-tetrahydro-furan-2-carboxylic acid ethylamide | CHEMBL223270
Type:
Small organic molecule
Emp. Form.:
C20H20N6O4
Mol. Mass.:
408.4106
SMILES:
CCNC(=O)[C@H]1O[C@H]([C@H](O)[C@@H]1O)n1cnc2c(N)nc(nc12)C#Cc1ccccc1
: