Target
D(3) dopamine receptor
Ligand
BDBM50054071
Substrate
Meas. Tech.
ChEMBL_62265 (CHEMBL675667)
Ki
76±n/a nM
Citation
 van Vliet, LATepper, PGDijkstra, DDamsma, GWikström, HPugsley, TAAkunne, HCHeffner, TGGlase, SAWise, LD Affinity for dopamine D2, D3, and D4 receptors of 2-aminotetralins. Relevance of D2 agonist binding for determination of receptor subtype selectivity. J Med Chem 39:4233-7 (1996)  
Target
Name:
D(3) dopamine receptor
Synonyms:
DOPAMINE D3 DRD3_HUMAN Dopamine D3 receptor (D3) Dopamine receptor Dopamine receptor D3
Type:
Mol. Mass.:
44243.43
Organism:
Homo sapiens (Human)
Description:
Residue:
400
  
Inhibitor
Name:
BDBM50054071
Synonyms:
(R)-6-Dipropylamino-5,6,7,8-tetrahydro-naphthalen-1-ol 6-Dipropylamino-5,6,7,8-tetrahydro-naphthalen-1-ol | CHEMBL15146
Type:
Small organic molecule
Emp. Form.:
C16H25NO
Mol. Mass.:
247.3758
SMILES:
CCCN(CCC)[C@@H]1CCc2c(O)cccc2C1
: