Target
D(3) dopamine receptor
Ligand
BDBM50054061
Substrate
Meas. Tech.
ChEMBL_62265 (CHEMBL675667)
Ki
113±n/a nM
Citation
 van Vliet, LATepper, PGDijkstra, DDamsma, GWikström, HPugsley, TAAkunne, HCHeffner, TGGlase, SAWise, LD Affinity for dopamine D2, D3, and D4 receptors of 2-aminotetralins. Relevance of D2 agonist binding for determination of receptor subtype selectivity. J Med Chem 39:4233-7 (1996)  
Target
Name:
D(3) dopamine receptor
Synonyms:
DOPAMINE D3 DRD3_HUMAN Dopamine D3 receptor (D3) Dopamine receptor Dopamine receptor D3
Type:
Mol. Mass.:
44243.43
Organism:
Homo sapiens (Human)
Description:
Residue:
400
  
Inhibitor
Name:
BDBM50054061
Synonyms:
((R)-7-Methoxy-1,2,3,4-tetrahydro-naphthalen-2-yl)-propyl-(2-thiophen-2-yl-ethyl)-amine | CHEMBL336295
Type:
Small organic molecule
Emp. Form.:
C20H27NOS
Mol. Mass.:
329.499
SMILES:
CCCN(CCc1cccs1)[C@@H]1CCc2ccc(OC)cc2C1
: