Target
D(4) dopamine receptor
Ligand
BDBM50054078
Substrate
Meas. Tech.
ChEMBL_61153 (CHEMBL670689)
Ki
54±n/a nM
Citation
 van Vliet, LATepper, PGDijkstra, DDamsma, GWikström, HPugsley, TAAkunne, HCHeffner, TGGlase, SAWise, LD Affinity for dopamine D2, D3, and D4 receptors of 2-aminotetralins. Relevance of D2 agonist binding for determination of receptor subtype selectivity. J Med Chem 39:4233-7 (1996)  
Target
Name:
D(4) dopamine receptor
Synonyms:
D(2C) dopamine receptor DOPAMINE D4.2 DRD4 Dopamine D4 receptor
Type:
Enzyme
Mol. Mass.:
48373.19
Organism:
Homo sapiens (Human)
Description:
P21917
Residue:
419
  
Inhibitor
Name:
BDBM50054078
Synonyms:
7-(Phenethyl-propyl-amino)-5,6,7,8-tetrahydro-naphthalen-2-ol | CHEMBL134747
Type:
Small organic molecule
Emp. Form.:
C21H27NO
Mol. Mass.:
309.4452
SMILES:
CCCN(CCc1ccccc1)C1CCc2ccc(O)cc2C1
: