Target
D(2) dopamine receptor
Ligand
BDBM50007422
Substrate
Meas. Tech.
ChEMBL_61462 (CHEMBL671443)
Kd
20±n/a nM
Citation
 Brusniak, MYPearlman, RSNeve, KAWilcox, RE Comparative molecular field analysis-based prediction of drug affinities at recombinant D1A dopamine receptors. J Med Chem 39:850-9 (1996)  
Target
Name:
D(2) dopamine receptor
Synonyms:
D(2) dopamine receptor DOPAMINE D2 Long DRD2 Dopamine D2 receptor Dopamine D2 receptor (D2R) Dopamine2-like | d2
Type:
Cell-surface receptors
Mol. Mass.:
50647.10
Organism:
Homo sapiens (Human)
Description:
P14416
Residue:
443
  
Inhibitor
Name:
BDBM50007422
Synonyms:
(+)-6-Propyl-5,6,6a,7-tetrahydro-4H-dibenzo[de,g]quinoline-10,11-diol (R) 6-Propyl-5,6,6a,7-tetrahydro-4H-dibenzo[de,g]quinoline-10,11-diol (R)-6-propyl-5,6,6a,7-tetrahydro-4H-dibenzo[de,g]quinoline-10,11-diol 6-Propyl-5,6,6a,7-tetrahydro-4H-dibenzo[de,g]quinoline-10,11-diol CHEMBL538542 N-propylnorapomorphine-(+) | N-propylnorapomorphine-(-)
Type:
Small organic molecule
Emp. Form.:
C19H21NO2
Mol. Mass.:
295.3755
SMILES:
CCCN1CCc2cccc-3c2[C@H]1Cc1ccc(O)c(O)c-31
: