Target
P-selectin
Ligand
BDBM50050458
Substrate
Meas. Tech.
ChEMBL_200018 (CHEMBL810707)
IC50
>1000000±n/a nM
Citation
 Ohmoto, HNakamura, KInoue, TKondo, NInoue, YYoshino, KKondo, HIshida, HKiso, MHasegawa, A Studies on selectin blocker. 1. Structure-activity relationships of sialyl Lewis X analogs. J Med Chem 39:1339-43 (1996)  
Target
Name:
P-selectin
Synonyms:
GMRP LYAM3_HUMAN P-selectin/P-selectin glycoprotein ligand 1 | SELP
Type:
PROTEIN
Mol. Mass.:
90834.61
Organism:
Homo sapiens (Human)
Description:
ChEMBL_1438999
Residue:
830
  
Inhibitor
Name:
BDBM50050458
Synonyms:
5-Acetylamino-2-{3,5-dihydroxy-2-hydroxymethyl-6-[2-hydroxymethyl-4-(3,4,5-trihydroxy-6-methyl-tetrahydro-pyran-2-yloxy)-tetrahydro-pyran-3-yloxy]-tetrahydro-pyran-4-yloxy}-4-hydroxy-6-((1R,2R)-1,2,3-trihydroxy-propyl)-tetrahydro-pyran-2-carboxylic acid | CHEMBL367520
Type:
Small organic molecule
Emp. Form.:
C28H47NO21
Mol. Mass.:
733.6669
SMILES:
C[C@@H]1O[C@@H](O[C@@H]2CCO[C@H](CO)[C@H]2O[C@@H]2O[C@H](O)[C@H](O[C@@]3(C[C@H](O)[C@@H](NC(C)=O)[C@@H](O3)[C@H](O)[C@H](O)CO)C(O)=O)[C@H](O)[C@H]2O)[C@@H](O)[C@H](O)[C@@H]1O
: