Target
E-selectin
Ligand
BDBM50050456
Substrate
Meas. Tech.
ChEMBL_60884 (CHEMBL673531)
IC50
240000±n/a nM
Citation
 Ohmoto, HNakamura, KInoue, TKondo, NInoue, YYoshino, KKondo, HIshida, HKiso, MHasegawa, A Studies on selectin blocker. 1. Structure-activity relationships of sialyl Lewis X analogs. J Med Chem 39:1339-43 (1996)  
Target
Name:
E-selectin
Synonyms:
ELAM1 SELE Selectin E
Type:
PROTEIN
Mol. Mass.:
66642.96
Organism:
Homo sapiens (Human)
Description:
ChEMBL_1438995
Residue:
610
  
Inhibitor
Name:
BDBM50050456
Synonyms:
5-(2-{3,5-Dihydroxy-2-hydroxymethyl-6-[2-hydroxymethyl-4-(2,3,4-trihydroxy-5-methoxy-hexyloxy)-tetrahydro-pyran-3-yloxy]-tetrahydro-pyran-4-yloxy}-acetylamino)-2,4-dihydroxy-6-(1,2,3-trihydroxy-propyl)-tetrahydro-pyran-2-carboxylic acid CHEMBL175649
Type:
Small organic molecule
Emp. Form.:
C28H47NO22
Mol. Mass.:
749.6663
SMILES:
C[C@@H]1O[C@@H](O[C@@H]2[C@@H](O)CO[C@H](CO)[C@H]2O[C@@H]2O[C@H](O)[C@H](O[C@@]3(C[C@H](O)[C@@H](NC(C)=O)[C@@H](O3)[C@H](O)[C@H](O)CO)C(O)=O)[C@H](O)[C@H]2O)[C@@H](O)[C@H](O)[C@@H]1O
: