Target
Glycogen phosphorylase, brain form
Ligand
BDBM34103
Substrate
Meas. Tech.
ChEMBL_70987 (CHEMBL680565)
Ki
1700000±n/a nM
Citation
 Pastor, MCruciani, GClementi, S Smart region definition: a new way to improve the predictive ability and interpretability of three-dimensional quantitative structure-activity relationships. J Med Chem 40:1455-64 (1997)  
Target
Name:
Glycogen phosphorylase, brain form
Synonyms:
Brain glycogen phosphorylase PYGB | PYGB_HUMAN
Type:
PROTEIN
Mol. Mass.:
96699.35
Organism:
Homo sapiens (Human)
Description:
ChEMBL_70998
Residue:
843
  
Inhibitor
Name:
BDBM34103
Synonyms:
D-glucose glucose
Type:
Emp. Form.:
C6H12O6
Mol. Mass.:
180.1559
SMILES:
OC[C@H]1OC(O)[C@H](O)[C@@H](O)[C@@H]1O
: