Target
Glutamate receptor 1
Ligand
BDBM17662
Substrate
Meas. Tech.
ChEMBL_90141 (CHEMBL878883)
Ki
103±n/a nM
Citation
 Jane, DEHoo, KKamboj, RDeverill, MBleakman, DMandelzys, A Synthesis of willardiine and 6-azawillardiine analogs: pharmacological characterization on cloned homomeric human AMPA and kainate receptor subtypes. J Med Chem 40:3645-50 (1997)  
Target
Name:
Glutamate receptor 1
Synonyms:
AMPA-selective glutamate receptor 1 GLUR1 GRIA1_HUMAN GluR-A Glutamate AMPA 1 Glutamate receptor AMPA 1/2 Glutamate receptor ionotropic, AMPA 1
Type:
Enzyme Catalytic Domain
Mol. Mass.:
101512.92
Organism:
Homo sapiens (Human)
Description:
Glutamate AMPA 1 GRIA1 HUMAN::P42261
Residue:
906
  
Inhibitor
Name:
BDBM17662
Synonyms:
(2S)-2-amino-3-(3-hydroxy-5-methyl-1,2-oxazol-4-yl)propanoic acid AMPA | CHEMBL276815
Type:
Small organic molecule
Emp. Form.:
C7H10N2O4
Mol. Mass.:
186.1653
SMILES:
Cc1o[nH]c(=O)c1C[C@H](N)C(O)=O
: