Target
5-hydroxytryptamine receptor 3A/3B
Ligand
BDBM50060685
Substrate
Meas. Tech.
ChEMBL_3170 (CHEMBL617698)
IC50
0.44±n/a nM
Citation
 Campiani, GCappelli, ANacci, VAnzini, MVomero, SHamon, MCagnotto, AFracasso, CUboldi, CCaccia, SConsolo, SMennini, T Novel and highly potent 5-HT3 receptor agonists based on a pyrroloquinoxaline structure. J Med Chem 40:3670-8 (1997)  
Target
Name:
5-hydroxytryptamine receptor 3A/3B
Synonyms:
Serotonin 3 (5-HT3) receptor | Serotonin 3a (5-HT3a)/3b (5-HT3b) receptor
Type:
Mol. Mass.:
Description:
ASSAY_ID of EBI is 2974
Components:
This complex has 2 components.
Component 1
Name:
5-hydroxytryptamine receptor 3B
Synonyms:
5HT3B_RAT Serotonin (5-HT) receptor
Type:
PROTEIN
Mol. Mass.:
50328.78
Organism:
Rattus norvegicus
Description:
EBI_11885
Residue:
437
  
Component 2
Name:
5-hydroxytryptamine receptor 3A
Synonyms:
5-HT3 5HT3A_RAT Htr3 Serotonin (5-HT) receptor | Zacopride site-R
Type:
Enzyme Catalytic Domain
Mol. Mass.:
55428.70
Organism:
RAT
Description:
5-HT3 HTR3A RAT::P35563
Residue:
483
  
Inhibitor
Name:
BDBM50060685
Synonyms:
9-Fluoro-4-(4-methyl-piperazin-1-yl)-pyrrolo[1,2-a]quinoxaline CHEMBL124886
Type:
Small organic molecule
Emp. Form.:
C16H17FN4
Mol. Mass.:
284.3314
SMILES:
CN1CCN(CC1)c1nc2cccc(F)c2n2cccc12
: