Target
Adenosine receptor A1
Ligand
BDBM50144950
Substrate
Meas. Tech.
ChEMBL_28847 (CHEMBL646709)
Ki
7120±n/a nM
Citation
 Van Calenbergh, Svon Frijtag Drabbe Künzel, JKBlaton, NMPeeters, OMRozenski, JVan Aerschot, ADe Bruyn, ADe Keukeleire, DIJzerman, APHerdewijn, P N6-cyclopentyl-3'-substituted-xylofuranosyladenosines: a new class of non-xanthine adenosine A1 receptor antagonists. J Med Chem 40:3765-72 (1997)  
Target
Name:
Adenosine receptor A1
Synonyms:
AA1R_RAT ADENOSINE A1 high Adenosine A1 receptor (A1) Adenosine receptors A1 | Adora1
Type:
Protein
Mol. Mass.:
36704.13
Organism:
Rattus norvegicus (rat)
Description:
Residue:
326
  
Inhibitor
Name:
BDBM50144950
Synonyms:
3'-deoxyadenosine 9-Cordyceposidoadenine CHEMBL305686 cordycepin
Type:
Small organic molecule
Emp. Form.:
C10H13N5O3
Mol. Mass.:
251.2419
SMILES:
Nc1ncnc2n(cnc12)[C@@H]1O[C@H](CO)C[C@H]1O
: