Target
D(1A) dopamine receptor
Ligand
BDBM50001859
Substrate
Meas. Tech.
ChEMBL_58985 (CHEMBL668650)
Ki
>1000±n/a nM
Citation
 el Ahmad, YLaurent, EMaillet, PTalab, ATeste, JFDokhan, RTran, GOllivier, R New benzocycloalkylpiperazines, potent and selective 5-HT1A receptor ligands. J Med Chem 40:952-60 (1997)  
Target
Name:
D(1A) dopamine receptor
Synonyms:
D(1A) dopamine receptor DRD1_MOUSE Dopamine receptor Drd1a | Gpcr15
Type:
Enzyme
Mol. Mass.:
49613.93
Organism:
Mus musculus (Mouse)
Description:
Q61616
Residue:
446
  
Inhibitor
Name:
BDBM50001859
Synonyms:
(buspirone) 8-[4-(4-Pyrimidin-2-yl-piperazin-1-yl)-butyl]-8-aza-spiro[4.5]decane-7,9-dione 8-[4-(4-Pyrimidin-2-yl-piperazin-1-yl)-butyl]-8-aza-spiro[4.5]decane-7,9-dione; Hydrochloride(Buspirone) BUSPAR CHEMBL49 | US10562853, Compound Buspirone
Type:
Small organic molecule
Emp. Form.:
C21H31N5O2
Mol. Mass.:
385.5031
SMILES:
O=C1CC2(CCCC2)CC(=O)N1CCCCN1CCN(CC1)c1ncccn1
: