Target
3 beta-hydroxysteroid dehydrogenase/Delta 5-->4-isomerase type 1
Ligand
BDBM50039266
Substrate
Meas. Tech.
ChEMBL_329 (CHEMBL615302)
Ki
12±n/a nM
Citation
 Kenny, BBallard, SBlagg, JFox, D Pharmacological options in the treatment of benign prostatic hyperplasia. J Med Chem 40:1293-315 (1997)  
Target
Name:
3 beta-hydroxysteroid dehydrogenase/Delta 5-->4-isomerase type 1
Synonyms:
3-beta-HSD I 3-beta-hydroxy-Delta(5)-steroid dehydrogenase 3BH Delta-5-3-ketosteroid isomerase HSDB3A Trophoblast antigen FDO161G
Type:
PROTEIN
Mol. Mass.:
42261.17
Organism:
Homo sapiens (Human)
Description:
ChEMBL_241
Residue:
373
  
Inhibitor
Name:
BDBM50039266
Synonyms:
(1S,9aR,11aS)-9a,11a-Dimethyl-7-oxo-2,3,3a,3b,4,5,7,8,9,9a,9b,10,11,11a-tetradecahydro-1H-cyclopenta[i]phenanthridine-1-carboxylic acid methyl ester CHEMBL297524
Type:
Small organic molecule
Emp. Form.:
C20H29NO3
Mol. Mass.:
331.4492
SMILES:
COC(=O)[C@H]1CCC2C3CN=C4CC(=O)CC[C@]4(C)C3CC[C@]12C
: