Target
3 beta-hydroxysteroid dehydrogenase/Delta 5-->4-isomerase type 1
Ligand
BDBM50057484
Substrate
Meas. Tech.
ChEMBL_329 (CHEMBL615302)
Ki
19±n/a nM
Citation
 Kenny, BBallard, SBlagg, JFox, D Pharmacological options in the treatment of benign prostatic hyperplasia. J Med Chem 40:1293-315 (1997)  
Target
Name:
3 beta-hydroxysteroid dehydrogenase/Delta 5-->4-isomerase type 1
Synonyms:
3-beta-HSD I 3-beta-hydroxy-Delta(5)-steroid dehydrogenase 3BH Delta-5-3-ketosteroid isomerase HSDB3A Trophoblast antigen FDO161G
Type:
PROTEIN
Mol. Mass.:
42261.17
Organism:
Homo sapiens (Human)
Description:
ChEMBL_241
Residue:
373
  
Inhibitor
Name:
BDBM50057484
Synonyms:
(1S,9aR,11aS)-6,9a,11a-Trimethyl-7-oxo-2,3,3a,3b,4,5,7,8,9,9a,9b,10,11,11a-tetradecahydro-1H-cyclopenta[i]phenanthridine-1-carboxylic acid (2,5-bis-trifluoromethyl-phenyl)-amide | CHEMBL25183
Type:
Small organic molecule
Emp. Form.:
C28H32F6N2O2
Mol. Mass.:
542.5563
SMILES:
CC1C(=O)CC[C@]2(C)C3CC[C@@]4(C)C(CC[C@@H]4C(=O)Nc4cc(ccc4C(F)(F)F)C(F)(F)F)C3CN=C12
: