Target
Adenosine receptor A1
Ligand
BDBM50454903
Substrate
Meas. Tech.
ChEMBL_28391 (CHEMBL639538)
EC50
225±n/a nM
Citation
 van der Wenden, EMCarnielli, MRoelen, HCLorenzen, Avon Frijtag Drabbe Künzel, JKIJzerman, AP 5'-substituted adenosine analogs as new high-affinity partial agonists for the adenosine A1 receptor. J Med Chem 41:102-8 (1998)  
Target
Name:
Adenosine receptor A1
Synonyms:
AA1R_RAT ADENOSINE A1 high Adenosine A1 receptor (A1) Adenosine receptors A1 | Adora1
Type:
Protein
Mol. Mass.:
36704.13
Organism:
Rattus norvegicus (rat)
Description:
Residue:
326
  
Inhibitor
Name:
BDBM50454903
Synonyms:
CHEMBL2113471
Type:
Small organic molecule
Emp. Form.:
C16H23N5O3Se
Mol. Mass.:
412.35
SMILES:
C[Se]C[C@H]1O[C@H]([C@H](O)[C@@H]1O)n1cnc2c(NC3CCCC3)ncnc12
: