Target
Adenosine receptor A1
Ligand
BDBM50375533
Substrate
Meas. Tech.
ChEMBL_28391 (CHEMBL639538)
EC50
127±n/a nM
Citation
 van der Wenden, EMCarnielli, MRoelen, HCLorenzen, Avon Frijtag Drabbe Künzel, JKIJzerman, AP 5'-substituted adenosine analogs as new high-affinity partial agonists for the adenosine A1 receptor. J Med Chem 41:102-8 (1998)  
Target
Name:
Adenosine receptor A1
Synonyms:
AA1R_RAT ADENOSINE A1 high Adenosine A1 receptor (A1) Adenosine receptors A1 | Adora1
Type:
Protein
Mol. Mass.:
36704.13
Organism:
Rattus norvegicus (rat)
Description:
Residue:
326
  
Inhibitor
Name:
BDBM50375533
Synonyms:
CHEMBL263643
Type:
Small organic molecule
Emp. Form.:
C17H25N5O3S
Mol. Mass.:
379.477
SMILES:
CCSC[C@H]1O[C@H]([C@H](O)[C@@H]1O)n1cnc2c(NC3CCCC3)ncnc12
: