Target
Adenosine receptor A2a
Ligand
BDBM25400
Substrate
Meas. Tech.
ChEMBL_31057 (CHEMBL873042)
Ki
385±n/a nM
Citation
 Franchetti, PCappellacci, LMarchetti, STrincavelli, LMartini, CMazzoni, MRLucacchini, AGrifantini, M 2'-C-Methyl analogues of selective adenosine receptor agonists: synthesis and binding studies. J Med Chem 41:1708-15 (1998)  
Target
Name:
Adenosine receptor A2a
Synonyms:
A2A adenosine receptor (hA2A) ADENOSINE A2 ADORA2 Adenosine A2A receptor (A2AAR)
Type:
G Protein-Coupled Receptor (GPCR)
Mol. Mass.:
44716.46
Organism:
Homo sapiens (Human)
Description:
P29274
Residue:
412
  
Inhibitor
Name:
BDBM25400
Synonyms:
(2R,3R,4S,5R)-2-[6-(cyclopentylamino)-9H-purin-9-yl]-5-(hydroxymethyl)oxolane-3,4-diol CPA N6-cyclopentyladenosine (CPA) | cid_657378
Type:
Small organic molecule
Emp. Form.:
C15H21N5O4
Mol. Mass.:
335.3583
SMILES:
OC[C@H]1O[C@H]([C@H](O)[C@@H]1O)n1cnc2c(NC3CCCC3)ncnc12
: