Target
DNA polymerase alpha catalytic subunit
Ligand
BDBM50408427
Substrate
Meas. Tech.
ChEMBL_50631 (CHEMBL658098)
IC50
>200000±n/a nM
Citation
 von Janta-Lipinski, MCostisella, BOchs, HHübscher, UHafkemeyer, PMatthes, E Newly synthesized L-enantiomers of 3'-fluoro-modified beta-2'-deoxyribonucleoside 5'-triphosphates inhibit hepatitis B DNA polymerases but not the five cellular DNA polymerases alpha, beta, gamma, delta, and epsilon nor HIV-1 reverse transcriptase. J Med Chem 41:2040-6 (1998)  
Target
Name:
DNA polymerase alpha catalytic subunit
Synonyms:
DNA polymerase (alpha/delta/epsilon) DPOLA_HUMAN POLA1
Type:
PROTEIN
Mol. Mass.:
165895.25
Organism:
Homo sapiens (Human)
Description:
ChEMBL_1365493
Residue:
1462
  
Inhibitor
Name:
BDBM50408427
Synonyms:
CHEMBL483492
Type:
Small organic molecule
Emp. Form.:
C10H17FN3O12P3
Mol. Mass.:
483.1746
SMILES:
Cc1cn([C@@H]2C[C@@H](F)[C@H](COP(O)(=O)OP(O)(=O)OP(O)(O)=O)O2)c(=O)nc1N
: